Reaction Details
TargetCholecystokinin receptor type A
LigandBDBM50007925
Substrate/Competitorn/a
Meas. Tech.ChEBML_49583
IC50 3.8±n/a nM
Citation Shiosaki, KLin, CWKopecka, HCraig, RWagenaar, FLBianchi, BMiller, TWitte, DNadzan, AM Development of CCK-tetrapeptide analogues as potent and selective CCK-A receptor agonists. J Med Chem33:2950-2 (1990) Cholecystokinin receptor type A
Name:Cholecystokinin receptor type A
Type:n/a
Mol. Mass.:48229.77
Organism:Cavia porcellus
Description:n/a
Residue:430
BDBM50007925
NameBDBM50007925
Synonyms:(S)-3-[(S)-2-[(S)-2-tert-Butoxycarbonylamino-3-(1H-indol-3-yl)-propionylamino]-6-(3-o-tolyl-ureido)-hexanoylamino]-N-((S)-1-carbamoyl-2-phenyl-ethyl)-succinamic acid CHEMBL320868
TypeSmall organic molecule
Emp. Form.C43H54N8O9
Mol. Mass.826.9371
SMILESCc1ccccc1NC(=O)NCCCC[C@H](NC(=O)[C@H](Cc1c[nH]c2ccccc12)NC(=O)OC(C)(C)C)C(=O)N[C@@H](CC(O)=O)C(=O)N[C@@H](Cc1ccccc1)C(N)=O