Reaction Details
TargetNeutrophil elastase
LigandBDBM50005178
Substrate/Competitorn/a
Meas. Tech.ChEBML_63659
IC50 73±n/a nM
Citation Skiles, JWFuchs, VMiao, CSorcek, RGrozinger, KGMauldin, SCVitous, JMui, PWJacober, SChow, G Inhibition of human leukocyte elastase (HLE) by N-substituted peptidyl trifluoromethyl ketones. J Med Chem35:641-62 (1992) Neutrophil elastase
Name:Neutrophil elastase
Type:Enzyme
Mol. Mass.:28532.38
Organism:Homo sapiens (Human)
Description:P08246
Residue:267
BDBM50005178
NameBDBM50005178
Synonyms:4-(4-Chloro-benzenesulfonylaminocarbonyl)-N-(2-methyl-1-{[(3,3,3-trifluoro-1-isopropyl-2-oxo-propylcarbamoyl)-methyl]-carbamoyl}-propyl)-benzamide | CHEMBL158735
TypeSmall organic molecule
Emp. Form.C27H30ClF3N4O7S
Mol. Mass.647.063
SMILESCC(C)C(NC(=O)c1ccc(cc1)C(=O)NS(=O)(=O)c1ccc(Cl)cc1)C(=O)NCC(=O)NC(C(C)C)C(=O)C(F)(F)F