Reaction Details
TargetEndothelin receptor type B
LigandBDBM50045244
Substrate/Competitorn/a
Meas. Tech.ChEBML_64039
IC50 60.0±n/a nM
Citation Doherty, AMCody, WLDePue, PLHe, JXWaite, LALeonard, DMLeitz, NLDudley, DTRapundalo, STHingorani, GP Structure-activity relationships of C-terminal endothelin hexapeptide antagonists. J Med Chem36:2585-94 (1993) Endothelin receptor type B
Name:Endothelin receptor type B
Type:Enzyme Catalytic Domain
Mol. Mass.:49483.43
Organism:RAT
Description:ENDOTHELIN B EDNRB RAT::P21451
Residue:442
BDBM50045244
NameBDBM50045244
Synonyms:(S)-3-[(S)-2-((R)-2-Acetylamino-3-phenyl-propionylamino)-3-phenyl-propionylamino]-N-{(S)-1-[(S)-(S)-1-((S)-1-carboxy-2-(S)-1H-indol-3-yl-ethylcarbamoyl)-2-methyl-butylcarbamoyl]-2-methyl-butyl}-succinamic acid CHEMBL313984
TypeSmall organic molecule
Emp. Form.C47H59N7O10
Mol. Mass.882.0123
SMILESCC[C@H](C)[C@H](NC(=O)[C@H](CC(O)=O)NC(=O)[C@H](Cc1ccccc1)NC(=O)[C@@H](Cc1ccccc1)NC(C)=O)C(=O)N[C@@H]([C@@H](C)CC)C(=O)N[C@@H](Cc1c[nH]c2ccccc12)C(O)=O