Reaction Details
TargetEndothelin-1 receptor
LigandBDBM50045263
Substrate/Competitorn/a
Meas. Tech.ChEMBL_65825 (CHEMBL682959)
EC50 25±n/a nM
Citation Doherty, AMCody, WLDePue, PLHe, JXWaite, LALeonard, DMLeitz, NLDudley, DTRapundalo, STHingorani, GP Structure-activity relationships of C-terminal endothelin hexapeptide antagonists. J Med Chem36:2585-94 (1993) Endothelin-1 receptor
Name:Endothelin-1 receptor
Type:Enzyme Catalytic Domain
Mol. Mass.:48736.88
Organism:Homo sapiens (Human)
Description:P25101
Residue:427
BDBM50045263
NameBDBM50045263
Synonyms:Ac-D-Dip-Glu-Asp-Ile-Ile-Trp | CHEMBL407269
TypeSmall organic molecule
Emp. Form.C49H61N7O12
Mol. Mass.940.0483
SMILESCC[C@H](C)[C@H](NC(=O)[C@@H](NC(=O)[C@H](CC(O)=O)NC(=O)[C@H](CCC(O)=O)NC(=O)[C@H](NC(C)=O)C(c1ccccc1)c1ccccc1)[C@@H](C)CC)C(=O)N[C@@H](Cc1c[nH]c2ccccc12)C(O)=O