Reaction Details
TargetAdenosylhomocysteinase
LigandBDBM50046747
Substrate/Competitorn/a
Meas. Tech.ChEMBL_197370 (CHEMBL800623)
Ki 39±n/a nM
Citation Liu, SWnuk, SFYuan, CRobins, MJBorchardt, RT Adenosine-5'-carboxaldehyde: a potent inhibitor of S-adenosyl-L-homocysteine hydrolase. J Med Chem36:883-7 (1993) Adenosylhomocysteinase
Name:Adenosylhomocysteinase
Type:PROTEIN
Mol. Mass.:47537.52
Organism:Rattus norvegicus
Description:ChEMBL_1507790
Residue:432
BDBM50046747
NameBDBM50046747
Synonyms:2-(6-Amino-purin-9-yl)-5-fluoromethylene-tetrahydro-furan-3,4-diol | CHEMBL171700
TypeSmall organic molecule
Emp. Form.C10H10FN5O3
Mol. Mass.267.2165
SMILESNc1ncnc2n(cnc12)[C@@H]1O\C(=C/F)[C@H](O)[C@@H]1O