Reaction Details
TargetCholecystokinin receptor type A
LigandBDBM50007925
Substrate/Competitorn/a
Meas. Tech.ChEMBL_49710 (CHEMBL661162)
IC50 3.8±n/a nM
Citation Holladay, MWKopecka, HMiller, TRBednarz, LNikkel, ALBianchi, BRWitte, DGShiosaki, KLin, CWAsin, KE Tetrapeptide CCK-A agonists: effect of backbone N-methylations on in vitro and in vivo CCK activity. J Med Chem37:630-5 (1994) Cholecystokinin receptor type A
Name:Cholecystokinin receptor type A
Type:n/a
Mol. Mass.:48229.77
Organism:Cavia porcellus
Description:n/a
Residue:430
BDBM50007925
NameBDBM50007925
Synonyms:(S)-3-[(S)-2-[(S)-2-tert-Butoxycarbonylamino-3-(1H-indol-3-yl)-propionylamino]-6-(3-o-tolyl-ureido)-hexanoylamino]-N-((S)-1-carbamoyl-2-phenyl-ethyl)-succinamic acid CHEMBL320868
TypeSmall organic molecule
Emp. Form.C43H54N8O9
Mol. Mass.826.9371
SMILESCc1ccccc1NC(=O)NCCCC[C@H](NC(=O)[C@H](Cc1c[nH]c2ccccc12)NC(=O)OC(C)(C)C)C(=O)N[C@@H](CC(O)=O)C(=O)N[C@@H](Cc1ccccc1)C(N)=O