Reaction Details
TargetMu-type opioid receptor
LigandBDBM50041146
Substrate/Competitorn/a
Meas. Tech.ChEMBL_138874 (CHEMBL747866)
Ki 2.1±n/a nM
Citation Schmidt, RVogel, DMrestani-Klaus, CBrandt, WNeubert, KChung, NNLemieux, CSchiller, PW Cyclic beta-casomorphin analogues with mixed mu agonist/delta antagonist properties: synthesis, pharmacological characterization, and conformational aspects. J Med Chem37:1136-44 (1994) Mu-type opioid receptor
Name:Mu-type opioid receptor
Type:G Protein-Coupled Receptor (GPCR)
Mol. Mass.:44503.11
Organism:Rattus norvegicus (rat)
Description:Competition binding assays were carried out using membrane preparations from transfected HN9.10 cells that constitutively expressed the mu opioid receptor.
Residue:398
BDBM50041146
NameBDBM50041146
Synonyms:(S)-2-Amino-3-(4-hydroxy-phenyl)-N-[(5S,8R,16aR)-5-(1H-indol-3-ylmethyl)-4,7,13,16-tetraoxo-hexadecahydro-3a,6,12,15-tetraaza-cyclopentacyclopentadecen-8-yl]-propionamide | CHEMBL14887
TypeSmall organic molecule
Emp. Form.C32H39N7O6
Mol. Mass.617.6954
SMILESN[C@@H](Cc1ccc(O)cc1)C(=O)N[C@@H]1CCCNC(=O)CNC(=O)[C@H]2CCCN2C(=O)[C@H](Cc2c[nH]c3ccccc23)NC1=O