Reaction Details
TargetAcetylcholinesterase
LigandBDBM50034002
Substrate/Competitorn/a
Meas. Tech.ChEMBL_28164 (CHEMBL885303)
IC50 6.8±n/a nM
Citation Nagel, AAListon, DRJung, SMahar, MVincent, LAChapin, DChen, YLHubbard, SIves, JLJones, SB Design and synthesis of 1-heteroaryl-3-(1-benzyl-4-piperidinyl)propan-1-one derivatives as potent, selective acetylcholinesterase inhibitors. J Med Chem38:1084-9 (1995) Acetylcholinesterase
Name:Acetylcholinesterase
Type:Enzyme
Mol. Mass.:67792.70
Organism:Homo sapiens (Human)
Description:P22303
Residue:614
BDBM50034002
NameBDBM50034002
Synonyms:3-(1-Benzyl-piperidin-4-yl)-1-(2-methyl-benzothiazol-6-yl)-propan-1-one; hydrochloride CHEMBL542543
TypeSmall organic molecule
Emp. Form.C23H26N2OS
Mol. Mass.378.53
SMILESCc1nc2ccc(cc2s1)C(=O)CCC1CCN(Cc2ccccc2)CC1