Reaction Details
TargetCholinesterase
LigandBDBM8960
Substrate/Competitorn/a
Meas. Tech.ChEMBL_41420 (CHEMBL654401)
IC50 2900±n/a nM
Citation Nagel, AAListon, DRJung, SMahar, MVincent, LAChapin, DChen, YLHubbard, SIves, JLJones, SB Design and synthesis of 1-heteroaryl-3-(1-benzyl-4-piperidinyl)propan-1-one derivatives as potent, selective acetylcholinesterase inhibitors. J Med Chem38:1084-9 (1995) Cholinesterase
Name:Cholinesterase
Type:Homotetramer
Mol. Mass.:68422.27
Organism:Homo sapiens (Human)
Description:P06276
Residue:602
BDBM8960
NameBDBM8960
Synonyms:(+/-)-2-[(1-benzylpiperidin-4-yl)methyl]-5,6-dimethoxy-indan-1-one Aricept CHEMBL1678 CHEMBL502 Donepezil E2020 US9346818, DPH US9663465, Donepezil
TypeSmall organic molecule
Emp. Form.C24H29NO3
Mol. Mass.379.492
SMILESCOc1cc2CC(CC3CCN(Cc4ccccc4)CC3)C(=O)c2cc1OC