Reaction Details
TargetAcetylcholinesterase
LigandBDBM50034000
Substrate/Competitorn/a
Meas. Tech.ChEMBL_28164 (CHEMBL885303)
IC50 30±n/a nM
Citation Nagel, AAListon, DRJung, SMahar, MVincent, LAChapin, DChen, YLHubbard, SIves, JLJones, SB Design and synthesis of 1-heteroaryl-3-(1-benzyl-4-piperidinyl)propan-1-one derivatives as potent, selective acetylcholinesterase inhibitors. J Med Chem38:1084-9 (1995) Acetylcholinesterase
Name:Acetylcholinesterase
Type:Enzyme
Mol. Mass.:67792.70
Organism:Homo sapiens (Human)
Description:P22303
Residue:614
BDBM50034000
NameBDBM50034000
Synonyms:3-(1-Benzyl-piperidin-4-yl)-1-(2,3-dihydro-benzo[1,4]dioxin-6-yl)-propan-1-one; hydrochloride CHEMBL557181
TypeSmall organic molecule
Emp. Form.C23H27NO3
Mol. Mass.365.4654
SMILESO=C(CCC1CCN(Cc2ccccc2)CC1)c1ccc2OCCOc2c1