Reaction Details
TargetDipeptidyl peptidase 4
LigandBDBM50050526
Substrate/Competitorn/a
Meas. Tech.ChEMBL_53379 (CHEMBL665783)
IC50 250±n/a nM
Citation Coutts, SJKelly, TASnow, RJKennedy, CABarton, RWAdams, JKrolikowski, DAFreeman, DMCampbell, SJKsiazek, JFBachovchin, WW Structure-activity relationships of boronic acid inhibitors of dipeptidyl peptidase IV. 1. Variation of the P2 position of Xaa-boroPro dipeptides. J Med Chem39:2087-94 (1996) 
 
Dipeptidyl peptidase 4
Name:Dipeptidyl peptidase 4
Type:Enzyme
Mol. Mass.:88271.01
Organism:Homo sapiens (Human)
Description:P27487
Residue:766
BDBM50050526
NameBDBM50050526
Synonyms:Boronic acid derivative | CHEMBL292342
TypeSmall organic molecule
Emp. Form.C8H15BN2O3
Mol. Mass.198.027
SMILESOB(O)[C@@H]1CCCN1C(=O)[C@@H]1CCN1