Reaction Details
TargetAngiotensin-converting enzyme
LigandBDBM50051791
Substrate/Competitorn/a
Meas. Tech.ChEMBL_35223 (CHEMBL648945)
IC50 0.70±n/a nM
Citation Fournie-Zaluski, MCCoric, PThery, VGonzalez, WMeudal, HTurcaud, SMichel, JBRoques, BP Design of orally active dual inhibitors of neutral endopeptidase and angiotensin-converting enzyme with long duration of action. J Med Chem39:2594-608 (1996) 
 
Angiotensin-converting enzyme
Name:Angiotensin-converting enzyme
Type:PROTEIN
Mol. Mass.:150907.81
Organism:Rattus norvegicus
Description:ChEMBL_35219
Residue:1313
BDBM50051791
NameBDBM50051791
Synonyms:(2S,5R)-5-(3-Hydroxy-phenyl)-1-{2-[(S)-3-(4-hydroxy-phenyl)-2-mercapto-propionylamino]-acetyl}-pyrrolidine-2-carboxylic acid | CHEMBL329823
TypeSmall organic molecule
Emp. Form.C22H24N2O6S
Mol. Mass.444.501
SMILESOC(=O)[C@@H]1CC[C@@H](N1C(=O)CNC(=O)[C@@H](S)Cc1ccc(O)cc1)c1cccc(O)c1