Reaction Details
TargetAngiotensin-converting enzyme
LigandBDBM50051794
Substrate/Competitorn/a
Meas. Tech.ChEMBL_35223 (CHEMBL648945)
IC50 3.5±n/a nM
Citation Fournie-Zaluski, MCCoric, PThery, VGonzalez, WMeudal, HTurcaud, SMichel, JBRoques, BP Design of orally active dual inhibitors of neutral endopeptidase and angiotensin-converting enzyme with long duration of action. J Med Chem39:2594-608 (1996) 
 
Angiotensin-converting enzyme
Name:Angiotensin-converting enzyme
Type:PROTEIN
Mol. Mass.:150907.81
Organism:Rattus norvegicus
Description:ChEMBL_35219
Residue:1313
BDBM50051794
NameBDBM50051794
Synonyms:(2S,5R)-1-{2-[(S)-3-(4-Amino-phenyl)-2-mercapto-propionylamino]-acetyl}-5-phenyl-pyrrolidine-2-carboxylic acid | CHEMBL89840
TypeSmall organic molecule
Emp. Form.C22H25N3O4S
Mol. Mass.427.517
SMILESNc1ccc(C[C@H](S)C(=O)NCC(=O)N2[C@@H](CC[C@@H]2c2ccccc2)C(O)=O)cc1