Reaction Details
TargetAngiotensin-converting enzyme
LigandBDBM50051786
Substrate/Competitorn/a
Meas. Tech.ChEMBL_35223 (CHEMBL648945)
IC50 2.5±n/a nM
Citation Fournie-Zaluski, MCCoric, PThery, VGonzalez, WMeudal, HTurcaud, SMichel, JBRoques, BP Design of orally active dual inhibitors of neutral endopeptidase and angiotensin-converting enzyme with long duration of action. J Med Chem39:2594-608 (1996) 
 
Angiotensin-converting enzyme
Name:Angiotensin-converting enzyme
Type:PROTEIN
Mol. Mass.:150907.81
Organism:Rattus norvegicus
Description:ChEMBL_35219
Residue:1313
BDBM50051786
NameBDBM50051786
Synonyms:(2S,5R)-1-{2-[(S)-3-(4-Hydroxy-phenyl)-2-mercapto-propionylamino]-acetyl}-5-p-tolyl-pyrrolidine-2-carboxylic acid | CHEMBL86803
TypeSmall organic molecule
Emp. Form.C23H26N2O5S
Mol. Mass.442.528
SMILESCc1ccc(cc1)[C@H]1CC[C@H](N1C(=O)CNC(=O)[C@@H](S)Cc1ccc(O)cc1)C(O)=O