Reaction Details
TargetNeprilysin
LigandBDBM50051794
Substrate/Competitorn/a
Meas. Tech.ChEMBL_144459 (CHEMBL755106)
IC50 1.8±n/a nM
Citation Fournie-Zaluski, MCCoric, PThery, VGonzalez, WMeudal, HTurcaud, SMichel, JBRoques, BP Design of orally active dual inhibitors of neutral endopeptidase and angiotensin-converting enzyme with long duration of action. J Med Chem39:2594-608 (1996) 
 
Neprilysin
Name:Neprilysin
Type:Enzyme
Mol. Mass.:85570.75
Organism:Oryctolagus cuniculus (rabbit)
Description:NEP was purified to homogeneity from rabbit kidney.
Residue:750
BDBM50051794
NameBDBM50051794
Synonyms:(2S,5R)-1-{2-[(S)-3-(4-Amino-phenyl)-2-mercapto-propionylamino]-acetyl}-5-phenyl-pyrrolidine-2-carboxylic acid | CHEMBL89840
TypeSmall organic molecule
Emp. Form.C22H25N3O4S
Mol. Mass.427.517
SMILESNc1ccc(C[C@H](S)C(=O)NCC(=O)N2[C@@H](CC[C@@H]2c2ccccc2)C(O)=O)cc1