Reaction Details
TargetMaltase-glucoamylase
LigandBDBM50408432
Substrate/Competitorn/a
Meas. Tech.ChEMBL_34390 (CHEMBL649260)
IC50 3200±n/a nM
Citation Asano, NNishida, MKato, AKizu, HMatsui, KShimada, YItoh, TBaba, MWatson, AANash, RJLilley, PMWatkin, DJFleet, GW Homonojirimycin isomers and N-alkylated homonojirimycins: structural and conformational basis of inhibition of glycosidases. J Med Chem41:2565-71 (1998) 
 
Maltase-glucoamylase
Name:Maltase-glucoamylase
Type:Enzyme
Mol. Mass.:209817.06
Organism:Homo sapiens (Human)
Description:O43451
Residue:2753
BDBM50408432
NameBDBM50408432
Synonyms:CHEMBL2115215
TypeSmall organic molecule
Emp. Form.C7H15NO5
Mol. Mass.193.1977
SMILESOC[C@H]1N[C@@H](CO)[C@@H](O)[C@@H](O)[C@@H]1O