Reaction Details
TargetSodium channel protein type 2 subunit alpha
LigandBDBM50066059
Substrate/Competitorn/a
Meas. Tech.ChEMBL_176837 (CHEMBL780605)
IC50 60±n/a nM
Citation Maillard, MCPerlman, MEAmitay, OBaxter, DBerlove, DConnaughton, SFischer, JBGuo, JQHu, LYMcBurney, RNNagy, PISubbarao, KYost, EAZhang, LDurant, GJ Design, synthesis, and pharmacological evaluation of conformationally constrained analogues of N,N'-diaryl- and N-aryl-N-aralkylguanidines as potent inhibitors of neuronal Na+ channels. J Med Chem41:3048-61 (1998) 
 
Sodium channel protein type 2 subunit alpha
Name:Sodium channel protein type 2 subunit alpha
Type:PROTEIN
Mol. Mass.:227854.11
Organism:Rattus norvegicus
Description:ChEMBL_1516893
Residue:2005
BDBM50066059
NameBDBM50066059
Synonyms:1,3-Bis-(4-sec-butyl-phenyl)-tetrahydro-pyrimidin-2-ylideneamine; hydrobromide | CHEMBL543868
TypeSmall organic molecule
Emp. Form.C24H33N3
Mol. Mass.363.5389
SMILESCCC(C)c1ccc(cc1)N1CCCN(C1=N)c1ccc(cc1)C(C)CC