Reaction Details
TargetKappa-type opioid receptor
LigandBDBM50291974
Substrate/Competitorn/a
Meas. Tech.ChEMBL_146372 (CHEMBL759292)
Ki 83±n/a nM
Citation Thomas, JBFall, MJCooper, JBRothman, RBMascarella, SWXu, HPartilla, JSDersch, CMMcCullough, KBCantrell, BEZimmerman, DMCarroll, FI Identification of an opioid kappa receptor subtype-selective N-substituent for (+)-(3R,4R)-dimethyl-4-(3-hydroxyphenyl)piperidine. J Med Chem41:5188-97 (1999) 
 
Kappa-type opioid receptor
Name:Kappa-type opioid receptor
Type:G Protein-Coupled Receptor (GPCR)
Mol. Mass.:42744.99
Organism:Cavia porcellus (domestic guinea pig)
Description:P41144
Residue:380
BDBM50291974
NameBDBM50291974
Synonyms:CHEMBL359088 | N-{(S)-1-Cyclohexyl-2-[4-(3-hydroxy-phenyl)-3,4-dimethyl-piperidin-1-yl]-ethyl}-3-(4-hydroxy-phenyl)-propionamide
TypeSmall organic molecule
Emp. Form.C30H42N2O3
Mol. Mass.478.6661
SMILESCC1CN(C[C@@H](NC(=O)CCc2ccc(O)cc2)C2CCCCC2)CCC1(C)c1cccc(O)c1