Reaction Details
TargetEndothelin-1 receptor
LigandBDBM50068695
Substrate/Competitorn/a
Meas. Tech.ChEMBL_63369 (CHEMBL676105)
Ki 110±n/a nM
Citation Murugesan, NGu, ZStein, PDBisaha, SSpergel, SGirotra, RLee, VGLloyd, JMisra, RNSchmidt, JMathur, AStratton, LKelly, YFBird, EWaldron, TLiu, ECZhang, RLee, HSerafino, RAbboa-Offei, BMathers, PGiancarli, MSeymour, AAWebb, MLHunt, JT Biphenylsulfonamide endothelin antagonists: structure-activity relationships of a series of mono- and disubstituted analogues and pharmacology of the orally active endothelin antagonist 2'-amino-N- (3,4-dimethyl-5-isoxazolyl)-4'-(2-methylpropyl)[1, 1'-biphenyl]-2-sulfonamide (BMS-187308). J Med Chem41:5198-218 (1999) 
 
Endothelin-1 receptor
Name:Endothelin-1 receptor
Type:Enzyme Catalytic Domain
Mol. Mass.:48256.91
Organism:RAT
Description:ENDOTHELIN A EDNRA RAT::P26684
Residue:426
BDBM50068695
NameBDBM50068695
Synonyms:4'-(2,2-Dimethyl-propyl)-biphenyl-2-sulfonic acid (3,4-dimethyl-isoxazol-5-yl)-amide | CHEMBL358545
TypeSmall organic molecule
Emp. Form.C22H26N2O3S
Mol. Mass.398.518
SMILESCc1noc(NS(=O)(=O)c2ccccc2-c2ccc(CC(C)(C)C)cc2)c1C