Reaction Details
TargetProthrombin
LigandBDBM50057828
Substrate/Competitorn/a
Meas. Tech.ChEMBL_208889 (CHEMBL814946)
Ki 0.10±n/a nM
Citation Brady, SFStauffer, KJLumma, WCSmith, GMRamjit, HGLewis, SDLucas, BJGardell, SJLyle, EAAppleby, SDCook, JJHolahan, MAStranieri, MTLynch, JJLin, JHChen, IWVastag, KNaylor-Olsen, AMVacca, JP Discovery and development of the novel potent orally active thrombin inhibitor N-(9-hydroxy-9-fluorenecarboxy)prolyl trans-4-aminocyclohexylmethyl amide (L-372,460): coapplication of structure-based design and rapid multiple analogue synthesis on solid support. J Med Chem41:401-6 (1998) 
 
Prothrombin
Name:Prothrombin
Type:Protein
Mol. Mass.:70029.57
Organism:Homo sapiens (Human)
Description:P00734
Residue:622
BDBM50057828
NameBDBM50057828
Synonyms:(S)-1-((R)-2-Amino-3,3-diphenyl-propionyl)-pyrrolidine-2-carboxylic acid (4-amino-cyclohexylmethyl)-amide | CHEMBL416795
TypeSmall organic molecule
Emp. Form.C27H36N4O2
Mol. Mass.448.6003
SMILESN[C@H](C(c1ccccc1)c1ccccc1)C(=O)N1CCC[C@H]1C(=O)NCC1CCC(N)CC1