Reaction Details
TargetProthrombin
LigandBDBM50062637
Substrate/Competitorn/a
Meas. Tech.ChEMBL_208876 (CHEMBL814934)
IC50 50±n/a nM
Citation Brady, SFStauffer, KJLumma, WCSmith, GMRamjit, HGLewis, SDLucas, BJGardell, SJLyle, EAAppleby, SDCook, JJHolahan, MAStranieri, MTLynch, JJLin, JHChen, IWVastag, KNaylor-Olsen, AMVacca, JP Discovery and development of the novel potent orally active thrombin inhibitor N-(9-hydroxy-9-fluorenecarboxy)prolyl trans-4-aminocyclohexylmethyl amide (L-372,460): coapplication of structure-based design and rapid multiple analogue synthesis on solid support. J Med Chem41:401-6 (1998) 
 
Prothrombin
Name:Prothrombin
Type:Protein
Mol. Mass.:70029.57
Organism:Homo sapiens (Human)
Description:P00734
Residue:622
BDBM50062637
NameBDBM50062637
Synonyms:(S)-1-[2-(3,4,5-Trimethoxy-phenyl)-acetyl]-pyrrolidine-2-carboxylic acid (4-amino-cyclohexylmethyl)-amide | CHEMBL334482
TypeSmall organic molecule
Emp. Form.C23H35N3O5
Mol. Mass.433.5411
SMILESCOc1cc(CC(=O)N2CCC[C@H]2C(=O)NCC2CCC(N)CC2)cc(OC)c1OC