Reaction Details
TargetKappa-type opioid receptor
LigandBDBM50369459
Substrate/Competitorn/a
Meas. Tech.ChEMBL_145851 (CHEMBL756114)
IC50 1206±n/a nM
Citation Houghten, RAPinilla, CAppel, JRBlondelle, SEDooley, CTEichler, JNefzi, AOstresh, JM Mixture-based synthetic combinatorial libraries. J Med Chem42:3743-78 (1999) Kappa-type opioid receptor
Name:Kappa-type opioid receptor
Type:G Protein-Coupled Receptor (GPCR)
Mol. Mass.:42648.76
Organism:Homo sapiens (Human)
Description:P41145
Residue:380
BDBM50369459
NameBDBM50369459
Synonyms:CHEMBL127486
TypeSmall organic molecule
Emp. Form.C27H45N3
Mol. Mass.411.6663
SMILESCC(C)C[C@@H]1CN2[C@H](CN=C2N1C(C)C12CC3CC(CC(C3)C1)C2)C1CCCCC1