Reaction Details
TargetKappa-type opioid receptor
LigandBDBM50272038
Substrate/Competitorn/a
Meas. Tech.ChEMBL_145797 (CHEMBL756064)
IC50 3677±n/a nM
Citation Houghten, RAPinilla, CAppel, JRBlondelle, SEDooley, CTEichler, JNefzi, AOstresh, JM Mixture-based synthetic combinatorial libraries. J Med Chem42:3743-78 (1999) Kappa-type opioid receptor
Name:Kappa-type opioid receptor
Type:G Protein-Coupled Receptor (GPCR)
Mol. Mass.:42648.76
Organism:Homo sapiens (Human)
Description:P41145
Residue:380
BDBM50272038
NameBDBM50272038
Synonyms:(2R,5S)-5-cyclohexyl-1-[(4-methylcyclohexyl)methyl]-2-(2-methylpropyl)-1H,2H,3H,5H,6H-imidazo[1,2-a]imidazolidin-7-ium
TypeSmall organic molecule
Emp. Form.C23H42N3
Mol. Mass.360.5991
SMILESCC(C)CC1C[N+]2=C(NCC2C2CCCCC2)N1CC1CCC(C)CC1