Reaction Details
TargetKappa-type opioid receptor
LigandBDBM50271917
Substrate/Competitorn/a
Meas. Tech.ChEMBL_145797 (CHEMBL756064)
IC50 3177±n/a nM
Citation Houghten, RAPinilla, CAppel, JRBlondelle, SEDooley, CTEichler, JNefzi, AOstresh, JM Mixture-based synthetic combinatorial libraries. J Med Chem42:3743-78 (1999) Kappa-type opioid receptor
Name:Kappa-type opioid receptor
Type:G Protein-Coupled Receptor (GPCR)
Mol. Mass.:42648.76
Organism:Homo sapiens (Human)
Description:P41145
Residue:380
BDBM50271917
NameBDBM50271917
Synonyms:(3R,6R)-7-(1-Adamantan-1-yl-ethyl)-3-cyclohexyl-6-(4-methoxy-benzyl)-2,5,6,7-tetrahydro-3H-imidazo[1,2-a]imidazol-1-ium
TypeSmall organic molecule
Emp. Form.C31H46N3O
Mol. Mass.476.7159
SMILESCOc1ccc(C[C@@H]2CN3[C@@H](C[NH+]=C3N2C(C)C23CC4CC(CC(C4)C2)C3)C2CCCCC2)cc1