Reaction Details
TargetMu-type opioid receptor
LigandBDBM36187
Substrate/Competitorn/a
Meas. Tech.ChEMBL_149309 (CHEMBL757305)
IC50 14±n/a nM
Citation Houghten, RAPinilla, CAppel, JRBlondelle, SEDooley, CTEichler, JNefzi, AOstresh, JM Mixture-based synthetic combinatorial libraries. J Med Chem42:3743-78 (1999) Mu-type opioid receptor
Name:Mu-type opioid receptor
Type:G Protein-Coupled Receptor (GPCR)
Mol. Mass.:44789.51
Organism:Homo sapiens (Human)
Description:P35372
Residue:400
BDBM36187
NameBDBM36187
Synonyms:1-methylhexylamine | Tuaminoheptane
TypeGuest
Emp. Form.C7H18N
Mol. Mass.116.224
SMILESCCCCCC(C)[NH3+]