Reaction Details
TargetKappa-type opioid receptor
LigandBDBM50271500
Substrate/Competitorn/a
Meas. Tech.ChEMBL_145851 (CHEMBL756114)
IC50 3744±n/a nM
Citation Houghten, RAPinilla, CAppel, JRBlondelle, SEDooley, CTEichler, JNefzi, AOstresh, JM Mixture-based synthetic combinatorial libraries. J Med Chem42:3743-78 (1999) Kappa-type opioid receptor
Name:Kappa-type opioid receptor
Type:G Protein-Coupled Receptor (GPCR)
Mol. Mass.:42648.76
Organism:Homo sapiens (Human)
Description:P41145
Residue:380
BDBM50271500
NameBDBM50271500
Synonyms:(3S,6R)-3-Cyclohexyl-7-(3-cyclohexyl-propyl)-6-isobutyl-2,5,6,7-tetrahydro-3H-imidazo[1,2-a]imidazol-1-ium
TypeSmall organic molecule
Emp. Form.C24H44N3
Mol. Mass.374.6257
SMILESCC(C)C[C@@H]1CN2[C@H](C[NH+]=C2N1CCCC1CCCCC1)C1CCCCC1