Reaction Details
TargetKappa-type opioid receptor
LigandBDBM50271959
Substrate/Competitorn/a
Meas. Tech.ChEMBL_145851 (CHEMBL756114)
IC50 425±n/a nM
Citation Houghten, RAPinilla, CAppel, JRBlondelle, SEDooley, CTEichler, JNefzi, AOstresh, JM Mixture-based synthetic combinatorial libraries. J Med Chem42:3743-78 (1999) Kappa-type opioid receptor
Name:Kappa-type opioid receptor
Type:G Protein-Coupled Receptor (GPCR)
Mol. Mass.:42648.76
Organism:Homo sapiens (Human)
Description:P41145
Residue:380
BDBM50271959
NameBDBM50271959
Synonyms:(3S,6R)-6-(4-Methoxy-benzyl)-3-methyl-7-(4-methyl-cyclohexylmethyl)-2,5,6,7-tetrahydro-3H-imidazo[1,2-a]imidazol-1-ium
TypeSmall organic molecule
Emp. Form.C22H34N3O
Mol. Mass.356.5243
SMILESCOc1ccc(C[C@@H]2CN3[C@@H](C)C[NH+]=C3N2CC2CCC(C)CC2)cc1