Reaction Details
TargetKappa-type opioid receptor
LigandBDBM50271815
Substrate/Competitorn/a
Meas. Tech.ChEMBL_145851 (CHEMBL756114)
IC50 5026±n/a nM
Citation Houghten, RAPinilla, CAppel, JRBlondelle, SEDooley, CTEichler, JNefzi, AOstresh, JM Mixture-based synthetic combinatorial libraries. J Med Chem42:3743-78 (1999) Kappa-type opioid receptor
Name:Kappa-type opioid receptor
Type:G Protein-Coupled Receptor (GPCR)
Mol. Mass.:42648.76
Organism:Homo sapiens (Human)
Description:P41145
Residue:380
BDBM50271815
NameBDBM50271815
Synonyms:(3S,6R)-3-Cyclohexyl-7-(3-cyclohexyl-propyl)-6-(4-methoxy-benzyl)-2,5,6,7-tetrahydro-3H-imidazo[1,2-a]imidazol-1-ium
TypeSmall organic molecule
Emp. Form.C28H44N3O
Mol. Mass.438.6679
SMILESCOc1ccc(C[C@@H]2CN3[C@H](C[NH+]=C3N2CCCC2CCCCC2)C2CCCCC2)cc1