Reaction Details
TargetKappa-type opioid receptor
LigandBDBM50271502
Substrate/Competitorn/a
Meas. Tech.ChEMBL_145851 (CHEMBL756114)
IC50 4424±n/a nM
Citation Houghten, RAPinilla, CAppel, JRBlondelle, SEDooley, CTEichler, JNefzi, AOstresh, JM Mixture-based synthetic combinatorial libraries. J Med Chem42:3743-78 (1999) Kappa-type opioid receptor
Name:Kappa-type opioid receptor
Type:G Protein-Coupled Receptor (GPCR)
Mol. Mass.:42648.76
Organism:Homo sapiens (Human)
Description:P41145
Residue:380
BDBM50271502
NameBDBM50271502
Synonyms:(3S,6S)-7-(2-Bicyclo[2.2.1]hept-2-yl-ethyl)-6-cyclohexyl-3-methyl-2,5,6,7-tetrahydro-3H-imidazo[1,2-a]imidazol-1-ium
TypeSmall organic molecule
Emp. Form.C21H36N3
Mol. Mass.330.5301
SMILESC[C@H]1C[NH+]=C2N(CCC3CC4CCC3C4)[C@H](CN12)C1CCCCC1