Reaction Details
TargetKappa-type opioid receptor
LigandBDBM50369465
Substrate/Competitorn/a
Meas. Tech.ChEMBL_145851 (CHEMBL756114)
IC50>10000±n/a nM
Citation Houghten, RAPinilla, CAppel, JRBlondelle, SEDooley, CTEichler, JNefzi, AOstresh, JM Mixture-based synthetic combinatorial libraries. J Med Chem42:3743-78 (1999) Kappa-type opioid receptor
Name:Kappa-type opioid receptor
Type:G Protein-Coupled Receptor (GPCR)
Mol. Mass.:42648.76
Organism:Homo sapiens (Human)
Description:P41145
Residue:380
BDBM50369465
NameBDBM50369465
Synonyms:CHEMBL125660
TypeSmall organic molecule
Emp. Form.C29H47N3
Mol. Mass.437.7036
SMILESCC(N1[C@H](CN2[C@@H](CN=C12)C1CCCCC1)C1CCCCC1)C12CC3CC(CC(C3)C1)C2