Reaction Details
TargetAminopeptidase N
LigandBDBM50083383
Substrate/Competitorn/a
Meas. Tech.ChEMBL_35498 (CHEMBL646408)
Ki 7000±n/a nM
Citation David, CBischoff, LMeudal, HMothé, ADe Mota, NDaNascimento, SLlorens-Cortes, CFournié-Zaluski, MCRoques, BP Investigation of subsite preferences in aminopeptidase A (EC 3.4.11.7) led to the design of the first highly potent and selective inhibitors of this enzyme. J Med Chem42:5197-211 (2000) Aminopeptidase N
Name:Aminopeptidase N
Type:Protein
Mol. Mass.:108810.25
Organism:Sus scrofa (Pig)
Description:P15145
Residue:963
BDBM50083383
NameBDBM50083383
Synonyms:1-{[(S)-1-((S)-1,2-Dicarboxy-ethylcarbamoyl)-2-(4-hydroxy-phenyl)-ethylcarbamoyl]-mercapto-methyl}-3-sulfamoyl-propyl-ammonium
TypeSmall organic molecule
Emp. Form.C18H27N4O9S2
Mol. Mass.507.558
SMILESNS(=O)(=O)CCC([NH3+])C(S)C(=O)N[C@@H](Cc1ccc(O)cc1)C(=O)N[C@@H](CC(O)=O)C(O)=O