Reaction Details
TargetNeprilysin
LigandBDBM50083394
Substrate/Competitorn/a
Meas. Tech.ChEMBL_144468 (CHEMBL755533)
Ki 22±n/a nM
Citation David, CBischoff, LMeudal, HMothé, ADe Mota, NDaNascimento, SLlorens-Cortes, CFournié-Zaluski, MCRoques, BP Investigation of subsite preferences in aminopeptidase A (EC 3.4.11.7) led to the design of the first highly potent and selective inhibitors of this enzyme. J Med Chem42:5197-211 (2000) Neprilysin
Name:Neprilysin
Type:Enzyme
Mol. Mass.:85570.75
Organism:Oryctolagus cuniculus (rabbit)
Description:NEP was purified to homogeneity from rabbit kidney.
Residue:750
BDBM50083394
NameBDBM50083394
Synonyms:1-{[1-(1,2-Dicarboxy-ethylcarbamoyl)-2-methyl-butylcarbamoyl]-mercapto-methyl}-3-sulfo-propyl-ammonium | CHEMBL358903
TypeSmall organic molecule
Emp. Form.C15H27N3O9S2
Mol. Mass.457.52
SMILESCC[C@@H](C)[C@H](NC(=O)[C@H](S)[C@H]([NH3+])CCS([O-])(=O)=O)C(=O)N[C@@H](CC(O)=O)C(O)=O