Reaction Details
TargetNeprilysin
LigandBDBM50083376
Substrate/Competitorn/a
Meas. Tech.ChEMBL_144468 (CHEMBL755533)
Ki 4±n/a nM
Citation David, CBischoff, LMeudal, HMothé, ADe Mota, NDaNascimento, SLlorens-Cortes, CFournié-Zaluski, MCRoques, BP Investigation of subsite preferences in aminopeptidase A (EC 3.4.11.7) led to the design of the first highly potent and selective inhibitors of this enzyme. J Med Chem42:5197-211 (2000) Neprilysin
Name:Neprilysin
Type:Enzyme
Mol. Mass.:85570.75
Organism:Oryctolagus cuniculus (rabbit)
Description:NEP was purified to homogeneity from rabbit kidney.
Residue:750
BDBM50083376
NameBDBM50083376
Synonyms:3-Carboxy-1-{[1-(1,2-dicarboxy-ethylcarbamoyl)-2-methyl-butylcarbamoyl]-mercapto-methyl}-propyl-ammonium | CHEMBL348205
TypeSmall organic molecule
Emp. Form.C16H27N3O8S
Mol. Mass.421.466
SMILESCC[C@@H](C)[C@H](NC(=O)[C@H](S)[C@H]([NH3+])CCC([O-])=O)C(=O)N[C@@H](CC(O)=O)C(O)=O