Reaction Details
TargetGlutamyl aminopeptidase
LigandBDBM50083379
Substrate/Competitorn/a
Meas. Tech.ChEMBL_32830 (CHEMBL873060)
Ki 1200±n/a nM
Citation David, CBischoff, LMeudal, HMothé, ADe Mota, NDaNascimento, SLlorens-Cortes, CFournié-Zaluski, MCRoques, BP Investigation of subsite preferences in aminopeptidase A (EC 3.4.11.7) led to the design of the first highly potent and selective inhibitors of this enzyme. J Med Chem42:5197-211 (2000) Glutamyl aminopeptidase
Name:Glutamyl aminopeptidase
Type:PROTEIN
Mol. Mass.:109226.47
Organism:Homo sapiens (Human)
Description:ChEMBL_32829
Residue:957
BDBM50083379
NameBDBM50083379
Synonyms:(3R,4S)-3-ammonio-5-{[(1S)-1-carboxy-2-methylbutyl]amino}-4-mercapto-5-oxopentane-1-sulfonate | CHEMBL148746
TypeSmall organic molecule
Emp. Form.C11H22N2O6S2
Mol. Mass.342.432
SMILESCC[C@@H](C)[C@H](NC(=O)[C@@H](S)[C@H]([NH3+])CCS([O-])(=O)=O)C(O)=O