Reaction Details
TargetGlutamyl aminopeptidase
LigandBDBM50083375
Substrate/Competitorn/a
Meas. Tech.ChEMBL_32830 (CHEMBL873060)
Ki 51±n/a nM
Citation David, CBischoff, LMeudal, HMothé, ADe Mota, NDaNascimento, SLlorens-Cortes, CFournié-Zaluski, MCRoques, BP Investigation of subsite preferences in aminopeptidase A (EC 3.4.11.7) led to the design of the first highly potent and selective inhibitors of this enzyme. J Med Chem42:5197-211 (2000) Glutamyl aminopeptidase
Name:Glutamyl aminopeptidase
Type:PROTEIN
Mol. Mass.:109226.47
Organism:Homo sapiens (Human)
Description:ChEMBL_32829
Residue:957
BDBM50083375
NameBDBM50083375
Synonyms:3-[(1S,2R)-1-((S)-1,2-Dicarboxy-ethylcarbamoyl)-2-methyl-butylamino]-2-mercapto-1-(2-sulfamoyl-ethyl)-propyl-ammonium
TypeSmall organic molecule
Emp. Form.C15H31N4O7S2
Mol. Mass.443.559
SMILESCC[C@@H](C)[C@H](NCC(S)C([NH3+])CCS(N)(=O)=O)C(=O)N[C@@H](CC(O)=O)C(O)=O