Reaction Details
TargetMu-type opioid receptor
LigandBDBM82551
Substrate/Competitorn/a
Meas. Tech.ChEMBL_148226 (CHEMBL753235)
Ki 56±n/a nM
Citation Schlechtingen, GZhang, LMaycock, ADeHaven, RNDaubert, JDCassel, JChung, NNSchiller, PWGoodman, M [Pro(3)]Dyn A(1-11)-NH(2): a dynorphin analogue with high selectivity for the kappa opioid receptor. J Med Chem43:2698-702 (2000) Mu-type opioid receptor
Name:Mu-type opioid receptor
Type:G Protein-Coupled Receptor (GPCR)
Mol. Mass.:44789.51
Organism:Homo sapiens (Human)
Description:P35372
Residue:400
BDBM82551
NameBDBM82551
Synonyms:C18130 NOR-BNI (HCI)2 | NORBNI
TypeSmall organic molecule
Emp. Form.C40H43N3O6
Mol. Mass.661.7859
SMILESOc1ccc2C[C@H]3N(CC4CC4)CC[C@@]45[C@@H](Oc1c24)c1[nH]c2[C@@H]4Oc6c7c(C[C@H]8N(CC9CC9)CC[C@@]47[C@@]8(O)Cc2c1C[C@@]35O)ccc6O