Reaction Details
TargetEndothelin-converting enzyme 1
LigandBDBM21641
Substrate/Competitorn/a
Meas. Tech.ChEMBL_225950 (CHEMBL843957)
IC50>100000±n/a nM
Citation De Lombaert, SBlanchard, LStamford, LBTan, JWallace, EMSatoh, YFitt, JHoyer, DSimonsbergen, DMoliterni, JMarcopoulos, NSavage, PChou, MTrapani, AJJeng, AY Potent and selective non-peptidic inhibitors of endothelin-converting enzyme-1 with sustained duration of action. J Med Chem43:488-504 (2000) Endothelin-converting enzyme 1
Name:Endothelin-converting enzyme 1
Type:Enzyme
Mol. Mass.:87155.11
Organism:Homo sapiens (Human)
Description:P42892
Residue:770
BDBM21641
NameBDBM21641
Synonyms:2-(2-benzyl-3-sulfanylpropanamido)acetic acid Thiorphan
TypeSmall organic molecule
Emp. Form.C12H15NO3S
Mol. Mass.253.317
SMILESOC(=O)CNC(=O)C(CS)Cc1ccccc1