Reaction Details
TargetMu-type opioid receptor
LigandBDBM50085050
Substrate/Competitorn/a
Meas. Tech.ChEMBL_147314 (CHEMBL755707)
Ki 0.467±n/a nM
Citation Schiller, PWBerezowska, INguyen, TMSchmidt, RLemieux, CChung, NNFalcone-Hindley, MLYao, WLiu, JIwama, SSmith, ABHirschmann, R Novel ligands lacking a positive charge for the delta- and mu-opioid receptors. J Med Chem43:551-9 (2000) Mu-type opioid receptor
Name:Mu-type opioid receptor
Type:G Protein-Coupled Receptor (GPCR)
Mol. Mass.:44503.11
Organism:Rattus norvegicus (rat)
Description:Competition binding assays were carried out using membrane preparations from transfected HN9.10 cells that constitutively expressed the mu opioid receptor.
Residue:398
BDBM50085050
NameBDBM50085050
Synonyms:CHEMBL152690 | H-Dmt-c [-D-Orn-2-Nal-D-Pro-Gly-]
TypeSmall organic molecule
Emp. Form.C36H44N6O6
Mol. Mass.656.7712
SMILESCc1cc(O)cc(C)c1C[C@H](N)C(=O)N[C@@H]1CCCNC(=O)CNC(=O)[C@H]2CCCN2C(=O)[C@H](Cc2ccc3ccccc3c2)NC1=O