Reaction Details
TargetcAMP-specific 3',5'-cyclic phosphodiesterase 4A
LigandBDBM50085136
Substrate/Competitorn/a
Meas. Tech.ChEMBL_155033 (CHEMBL765475)
IC50 350±n/a nM
Citation Hersperger, RBray-French, KMazzoni, LMüller, T Palladium-catalyzed cross-coupling reactions for the synthesis of 6, 8-disubstituted 1,7-naphthyridines: a novel class of potent and selective phosphodiesterase type 4D inhibitors. J Med Chem43:675-82 (2000) cAMP-specific 3',5'-cyclic phosphodiesterase 4A
Name:cAMP-specific 3',5'-cyclic phosphodiesterase 4A
Type:Enzyme
Mol. Mass.:98113.27
Organism:Homo sapiens (Human)
Description:P27815
Residue:886
BDBM50085136
NameBDBM50085136
Synonyms:8-(3-Nitro-phenyl)-6-phenyl-[1,7]naphthyridine | CHEMBL161465
TypeSmall organic molecule
Emp. Form.C20H13N3O2
Mol. Mass.327.3361
SMILES[O-][N+](=O)c1cccc(c1)-c1nc(cc2cccnc12)-c1ccccc1