Reaction Details
TargetcAMP-specific 3',5'-cyclic phosphodiesterase 4C
LigandBDBM50085140
Substrate/Competitorn/a
Meas. Tech.ChEMBL_155176 (CHEMBL761823)
IC50 890±n/a nM
Citation Hersperger, RBray-French, KMazzoni, LMüller, T Palladium-catalyzed cross-coupling reactions for the synthesis of 6, 8-disubstituted 1,7-naphthyridines: a novel class of potent and selective phosphodiesterase type 4D inhibitors. J Med Chem43:675-82 (2000) cAMP-specific 3',5'-cyclic phosphodiesterase 4C
Name:cAMP-specific 3',5'-cyclic phosphodiesterase 4C
Type:Enzyme Catalytic Domain
Mol. Mass.:79875.54
Organism:Homo sapiens (Human)
Description:Q08493
Residue:712
BDBM50085140
NameBDBM50085140
Synonyms:6-Allyl-8-(3-nitro-phenyl)-[1,7]naphthyridine | CHEMBL351500
TypeSmall organic molecule
Emp. Form.C17H13N3O2
Mol. Mass.291.304
SMILES[O-][N+](=O)c1cccc(c1)-c1nc(CC=C)cc2cccnc12