Reaction Details
TargetcAMP-specific 3',5'-cyclic phosphodiesterase 4D
LigandBDBM50085142
Substrate/Competitorn/a
Meas. Tech.ChEMBL_155180 (CHEMBL761827)
IC50 1600±n/a nM
Citation Hersperger, RBray-French, KMazzoni, LMüller, T Palladium-catalyzed cross-coupling reactions for the synthesis of 6, 8-disubstituted 1,7-naphthyridines: a novel class of potent and selective phosphodiesterase type 4D inhibitors. J Med Chem43:675-82 (2000) cAMP-specific 3',5'-cyclic phosphodiesterase 4D
Name:cAMP-specific 3',5'-cyclic phosphodiesterase 4D
Type:Protein
Mol. Mass.:91092.69
Organism:Homo sapiens (Human)
Description:Q08499
Residue:809
BDBM50085142
NameBDBM50085142
Synonyms:8-(3-Nitro-phenyl)-[1,7]naphthyridin-6-ylamine | CHEMBL345812
TypeSmall organic molecule
Emp. Form.C14H10N4O2
Mol. Mass.266.2548
SMILESNc1cc2cccnc2c(n1)-c1cccc(c1)[N+]([O-])=O