Reaction Details
TargetcAMP-specific 3',5'-cyclic phosphodiesterase 4B
LigandBDBM50085139
Substrate/Competitorn/a
Meas. Tech.ChEMBL_155173 (CHEMBL761911)
IC50 85±n/a nM
Citation Hersperger, RBray-French, KMazzoni, LMüller, T Palladium-catalyzed cross-coupling reactions for the synthesis of 6, 8-disubstituted 1,7-naphthyridines: a novel class of potent and selective phosphodiesterase type 4D inhibitors. J Med Chem43:675-82 (2000) cAMP-specific 3',5'-cyclic phosphodiesterase 4B
Name:cAMP-specific 3',5'-cyclic phosphodiesterase 4B
Type:Enzyme Catalytic Domain
Mol. Mass.:83349.50
Organism:RAT
Description:P14646
Residue:736
BDBM50085139
NameBDBM50085139
Synonyms:4-[8-(3-Cyano-phenyl)-[1,7]naphthyridin-6-yl]-benzoic acid | CHEMBL161740
TypeSmall organic molecule
Emp. Form.C22H13N3O2
Mol. Mass.351.3575
SMILESOC(=O)c1ccc(cc1)-c1cc2cccnc2c(n1)-c1cccc(c1)C#N