Reaction Details
TargetGag-Pol polyprotein [489-587]
LigandBDBM50086880
Substrate/Competitorn/a
Meas. Tech.ChEMBL_160747 (CHEMBL769061)
Ki 1±n/a nM
Citation Fairlie, DPTyndall, JDReid, RCWong, AKAbbenante, GScanlon, MJMarch, DRBergman, DAChai, CLBurkett, BA Conformational selection of inhibitors and substrates by proteolytic enzymes: implications for drug design and polypeptide processing. J Med Chem43:1271-81 (2001) Gag-Pol polyprotein [489-587]
Name:Gag-Pol polyprotein [489-587]
Type:Enzyme Subunit
Mol. Mass.:10781.16
Organism:Human immunodeficiency virus type 1
Description:P04585[489-587]
Residue:99
BDBM50086880
NameBDBM50086880
Synonyms:Proteolytic Enzyme inhibitor
TypeSmall organic molecule
Emp. Form.C45H71N10O16S
Mol. Mass.1040.168
SMILESCC(C)C[C@@H](NC(=O)[C@H](O)COS([O-])(=O)=O)C(=O)N[C@H]1[C@@H](C)OC(=O)[C@H](NC(=O)[C@@H](Cc2ccc(O)cc2)N(C)C(=O)[C@H](CC(C)C)N2[C@@H](O)CC[C@H](NC(=O)[C@H](CCCNC(N)=N)NC1=O)C2=O)C(C)C