Reaction Details
TargetGag-Pol polyprotein [489-587]
LigandBDBM50086884
Substrate/Competitorn/a
Meas. Tech.ChEMBL_160747 (CHEMBL769061)
Ki 1±n/a nM
Citation Fairlie, DPTyndall, JDReid, RCWong, AKAbbenante, GScanlon, MJMarch, DRBergman, DAChai, CLBurkett, BA Conformational selection of inhibitors and substrates by proteolytic enzymes: implications for drug design and polypeptide processing. J Med Chem43:1271-81 (2001) Gag-Pol polyprotein [489-587]
Name:Gag-Pol polyprotein [489-587]
Type:Enzyme Subunit
Mol. Mass.:10781.16
Organism:Human immunodeficiency virus type 1
Description:P04585[489-587]
Residue:99
BDBM50086884
NameBDBM50086884
Synonyms:(R)-N*4*-Hydroxy-2-isobutyl-N*1*-((S)-9-oxo-1,8-diaza-tricyclo[10.6.1.0*13,18*]nonadeca-12(19),13(18),14,16-tetraen-10-yl)-succinamide N*4*-Hydroxy-2-isobutyl-N*1*-(9-oxo-1,8-diaza-tricyclo[10.6.1.0*13,18*]nonadeca-12(19),13(18),14,16-tetraen-10-yl)-succinamide | N4-HYDROXY-2-ISOBUTYL-N1-(9-OXO-1,8-DIAZA-TRICYCLO[10.6.1.013,18]NONADECA-12(19),13,15,17-TETRAEN-10-YL)-SUCCINAMIDE
TypeSmall organic molecule
Emp. Form.C25H36N4O4
Mol. Mass.456.5777
SMILESCC(C)C[C@H](CC(=O)NO)C(=O)N[C@H]1Cc2cn(CCCCCCNC1=O)c1ccccc21