Reaction Details
TargetNociceptin receptor
LigandBDBM50087016
Substrate/Competitorn/a
Meas. Tech.ChEMBL_146119 (CHEMBL754588)
Ki 0.520000±n/a nM
Citation Röver, SAdam, GCesura, AMGalley, GJenck, FMonsma, FJWichmann, JDautzenberg, FM High-affinity, non-peptide agonists for the ORL1 (orphanin FQ/nociceptin) receptor. J Med Chem43:1329-38 (2001) Nociceptin receptor
Name:Nociceptin receptor
Type:G Protein-Coupled Receptor (GPCR)
Mol. Mass.:40702.87
Organism:Homo sapiens (Human)
Description:P41146
Residue:370
BDBM50087016
NameBDBM50087016
Synonyms:8-Acenaphthen-1-yl-1-phenyl-1,3,8-triaza-spiro[4.5]decan-4-one Ro65-6570
TypeSmall organic molecule
Emp. Form.C25H25N3O
Mol. Mass.383.4855
SMILESO=C1NCN(c2ccccc2)C11CCN(CC1)C1Cc2cccc3cccc1c23