Reaction Details
TargetNociceptin receptor
LigandBDBM50087003
Substrate/Competitorn/a
Meas. Tech.ChEMBL_146107 (CHEMBL883401)
Ki 7.2±n/a nM
Citation Röver, SAdam, GCesura, AMGalley, GJenck, FMonsma, FJWichmann, JDautzenberg, FM High-affinity, non-peptide agonists for the ORL1 (orphanin FQ/nociceptin) receptor. J Med Chem43:1329-38 (2001) Nociceptin receptor
Name:Nociceptin receptor
Type:G Protein-Coupled Receptor (GPCR)
Mol. Mass.:40702.87
Organism:Homo sapiens (Human)
Description:P41146
Residue:370
BDBM50087003
NameBDBM50087003
Synonyms:8-(8-Chloro-1,2,3,4-tetrahydro-naphthalen-2-yl)-3-(2-hydroxy-ethyl)-1-phenyl-1,3,8-triaza-spiro[4.5]decan-4-one | CHEMBL26987
TypeSmall organic molecule
Emp. Form.C25H30ClN3O2
Mol. Mass.439.978
SMILESOCCN1CN(c2ccccc2)C2(CCN(CC2)C2CCc3cccc(Cl)c3C2)C1=O