Reaction Details
TargetMu-type opioid receptor
LigandBDBM50087004
Substrate/Competitorn/a
Meas. Tech.ChEMBL_148233 (CHEMBL753393)
Ki 2.6±n/a nM
Citation Röver, SAdam, GCesura, AMGalley, GJenck, FMonsma, FJWichmann, JDautzenberg, FM High-affinity, non-peptide agonists for the ORL1 (orphanin FQ/nociceptin) receptor. J Med Chem43:1329-38 (2001) Mu-type opioid receptor
Name:Mu-type opioid receptor
Type:G Protein-Coupled Receptor (GPCR)
Mol. Mass.:44789.51
Organism:Homo sapiens (Human)
Description:P35372
Residue:400
BDBM50087004
NameBDBM50087004
Synonyms:8-(5,8-Dichloro-1,2,3,4-tetrahydro-naphthalen-2-yl)-3-methyl-1-phenyl-1,3,8-triaza-spiro[4.5]decan-4-one | CHEMBL27729
TypeSmall organic molecule
Emp. Form.C24H27Cl2N3O
Mol. Mass.444.397
SMILESCN1CN(c2ccccc2)C2(CCN(CC2)C2CCc3c(Cl)ccc(Cl)c3C2)C1=O