Reaction Details
TargetKappa-type opioid receptor
LigandBDBM50027473
Substrate/Competitorn/a
Meas. Tech.ChEMBL_145260 (CHEMBL751038)
Ki 5.5±n/a nM
Citation Röver, SAdam, GCesura, AMGalley, GJenck, FMonsma, FJWichmann, JDautzenberg, FM High-affinity, non-peptide agonists for the ORL1 (orphanin FQ/nociceptin) receptor. J Med Chem43:1329-38 (2001) Kappa-type opioid receptor
Name:Kappa-type opioid receptor
Type:G Protein-Coupled Receptor (GPCR)
Mol. Mass.:42648.76
Organism:Homo sapiens (Human)
Description:P41145
Residue:380
BDBM50027473
NameBDBM50027473
Synonyms:3-Methyl-1-phenethyl-4-(phenyl-propionyl-amino)-piperidine-4-carboxylic acid methyl ester CHEMBL28198
TypeSmall organic molecule
Emp. Form.C25H32N2O3
Mol. Mass.408.5332
SMILESCCC(=O)N(c1ccccc1)[C@]1(CCN(CCc2ccccc2)C[C@H]1C)C(=O)OC