Reaction Details
TargetKappa-type opioid receptor
LigandBDBM50087015
Substrate/Competitorn/a
Meas. Tech.ChEMBL_145260 (CHEMBL751038)
Ki 11±n/a nM
Citation Röver, SAdam, GCesura, AMGalley, GJenck, FMonsma, FJWichmann, JDautzenberg, FM High-affinity, non-peptide agonists for the ORL1 (orphanin FQ/nociceptin) receptor. J Med Chem43:1329-38 (2001) Kappa-type opioid receptor
Name:Kappa-type opioid receptor
Type:G Protein-Coupled Receptor (GPCR)
Mol. Mass.:42648.76
Organism:Homo sapiens (Human)
Description:P41145
Residue:380
BDBM50087015
NameBDBM50087015
Synonyms:1-Phenyl-8-(1,2,3,4-tetrahydro-naphthalen-1-yl)-1,3,8-triaza-spiro[4.5]decan-4-one | CHEMBL27460
TypeSmall organic molecule
Emp. Form.C23H27N3O
Mol. Mass.361.48
SMILESO=C1NCN(c2ccccc2)C11CCN(CC1)C1CCCc2ccccc12