Reaction Details
TargetcGMP-specific 3',5'-cyclic phosphodiesterase
LigandBDBM50100684
Substrate/Competitorn/a
Meas. Tech.ChEMBL_154560 (CHEMBL757895)
IC50>10000±n/a nM
Citation Ukita, TNakamura, YKubo, AYamamoto, YMoritani, YSaruta, KHigashijima, TKotera, JTakagi, MKikkawa, KOmori, K Novel, potent, and selective phosphodiesterase 5 inhibitors: synthesis and biological activities of a series of 4-aryl-1-isoquinolinone derivatives. J Med Chem44:2204-18 (2001) cGMP-specific 3',5'-cyclic phosphodiesterase
Name:cGMP-specific 3',5'-cyclic phosphodiesterase
Type:PROTEIN
Mol. Mass.:98285.03
Organism:Canis lupus familiaris
Description:ChEMBL_105565
Residue:865
BDBM50100684
NameBDBM50100684
Synonyms:6,7-Dimethoxy-2-(4-methylamino-phenyl)-1-oxo-4-(3,4,5-trimethoxy-phenyl)-1,2-dihydro-isoquinoline-3-carboxylic acid methyl ester | CHEMBL305014
TypeSmall organic molecule
Emp. Form.C29H30N2O8
Mol. Mass.534.5571
SMILESCNc1ccc(cc1)-n1c(C(=O)OC)c(-c2cc(OC)c(OC)c(OC)c2)c2cc(OC)c(OC)cc2c1=O